[CITE-Forum] building teamengine error against master

Richard Martell rmartell at galdosinc.com
Fri May 15 14:03:54 EDT 2015


Tom,

JDK 7 or higher is required, but note that JDK7 was recently retired. 
<https://www.java.com/en/download/faq/java_7.xml> 

It is also possible to run the test suite in an IDE or from a command shell: 
<https://github.com/opengeospatial/ets-cat30/wiki>


-- Richard

-----Original Message-----
From: CITE-Forum [mailto:cite-forum-bounces at lists.opengeospatial.org] On Behalf Of Tom Kralidis
Sent: Thursday, 14 May, 2015 16:23
To: cite-forum at lists.opengeospatial.org
Subject: Re: [CITE-Forum] building teamengine error against master

Looks like upgrading to Java 1.7 solved this issue.  Sorry for the noise.

On Thu, May 14, 2015 at 6:50 PM, Tom Kralidis <tomkralidis at gmail.com> wrote:
> Hi all: I'm trying to build teamengine with the goal of locally 
> running the ets-cat30 [1], and getting the below error against master:
>
> Any idea what I'm doing wrong here?
>
> Thanks
>
> ..Tom
>
>
> tkralidi at www:~/work/foss4g/teamengine/teamengine$
> ../../apache-maven-3.0.5/bin/mvn  install [INFO] Scanning for 
> projects...
> [INFO] 
> ----------------------------------------------------------------------
> --
> [INFO] Reactor Build Order:
> [INFO]
> [INFO] TEAM Engine
> [INFO] TEAM Engine - Tomcat Realm
> [INFO] TEAM Engine - Shared Resources
> [INFO] TEAM Engine - Core Module
> [INFO] TEAM Engine - Service Providers [INFO] TEAM Engine - Web 
> Application [INFO] TEAM Engine - Console Application [INFO] [INFO] 
> ----------------------------------------------------------------------
> -- [INFO] Building TEAM Engine 4.1.0-SNAPSHOT [INFO] 
> ----------------------------------------------------------------------
> --
> [INFO]
> [INFO] --- maven-install-plugin:2.3.1:install (default-install) @ 
> teamengine --- [INFO] Installing 
> /home/tkralidi/work/foss4g/teamengine/teamengine/pom.xml to 
> /home/tkralidi/.m2/repository/org/opengis/cite/teamengine/4.1.0-SNAPSH
> OT/teamengine-4.1.0-SNAPSHOT.pom
> [INFO]
> [INFO] 
> ----------------------------------------------------------------------
> -- [INFO] Building TEAM Engine - Tomcat Realm 4.1.0-SNAPSHOT [INFO] 
> ----------------------------------------------------------------------
> --
> [INFO]
> [INFO] --- maven-resources-plugin:2.5:resources (default-resources) @ 
> teamengine-realm --- [debug] execute contextualize [INFO] Using 
> 'UTF-8' encoding to copy filtered resources.
> [INFO] Copying 1 resource
> [INFO]
> [INFO] --- maven-compiler-plugin:3.2:compile (default-compile) @ 
> teamengine-realm --- [INFO] Changes detected - recompiling the module!
> [INFO] Compiling 1 source file to
> /home/tkralidi/work/foss4g/teamengine/teamengine/teamengine-realm/targ
> et/classes [INFO] 
> ----------------------------------------------------------------------
> --
> [INFO] Reactor Summary:
> [INFO]
> [INFO] TEAM Engine ....................................... SUCCESS 
> [0.743s] [INFO] TEAM Engine - Tomcat Realm ........................ 
> FAILURE [1.830s] [INFO] TEAM Engine - Shared Resources 
> .................... SKIPPED [INFO] TEAM Engine - Core Module 
> ......................... SKIPPED [INFO] TEAM Engine - Service 
> Providers ................... SKIPPED [INFO] TEAM Engine - Web 
> Application ..................... SKIPPED [INFO] TEAM Engine - Console 
> Application ................. SKIPPED [INFO] 
> ----------------------------------------------------------------------
> --
> [INFO] BUILD FAILURE
> [INFO] 
> ----------------------------------------------------------------------
> --
> [INFO] Total time: 3.282s
> [INFO] Finished at: Thu May 14 18:38:38 EDT 2015 [INFO] Final Memory: 
> 6M/15M [INFO] 
> ----------------------------------------------------------------------
> --
> [ERROR] Failed to execute goal
> org.apache.maven.plugins:maven-compiler-plugin:3.2:compile
> (default-compile) on project teamengine-realm: Fatal error compiling:
> invalid target release: 1.7 -> [Help 1] [ERROR] [ERROR] To see the 
> full stack trace of the errors, re-run Maven with the -e switch.
> [ERROR] Re-run Maven using the -X switch to enable full debug logging.
> [ERROR]
> [ERROR] For more information about the errors and possible solutions, 
> please read the following articles:
> [ERROR] [Help 1]
> http://cwiki.apache.org/confluence/display/MAVEN/MojoExecutionExceptio
> n
> [ERROR]
> [ERROR] After correcting the problems, you can resume the build with the command
> [ERROR]   mvn <goals> -rf :teamengine-realm
> tkralidi at www:~/work/foss4g/teamengine/teamengine$
>
>
>
> [1] https://github.com/opengeospatial/ets-cat30
_______________________________________________
CITE-Forum mailing list
CITE-Forum at lists.opengeospatial.org
https://lists.opengeospatial.org/mailman/listinfo/cite-forum


More information about the CITE-Forum mailing list