[CITE-Forum] WFS 2.0 cite tests skipping all tests

Richard Martell rmartell at galdosinc.com
Mon Jul 20 14:17:57 EDT 2015


Hi Andrea,

Some of the test suites may currently be out of sync with respect to common dependencies; using the latest version of a given lib (and removing older ones) should resolve the issue you encountered.

FYI, the ets-resources project can be used to configure/maintain TE_BASE; older libs should be pruned if necessary when the setup-tebase script is run.
<https://github.com/opengeospatial/ets-resources>

A new ETS naming convention was adopted a little while ago ({ets-code}{SPEC_MAJOR}{SPEC_MINOR}). I don’t recall where exactly this is described, but Luis B. can probably provide a link.


-- Richard


From: CITE-Forum [mailto:cite-forum-bounces+rmartell=galdosinc.com at lists.opengeospatial.org] On Behalf Of Andrea Aime via CITE-Forum
Sent: Sunday, 19 July, 2015 09:08
To: cite-forum at lists.opengeospatial.org
Subject: Re: [CITE-Forum] WFS 2.0 cite tests skipping all tests

And oh, one final minor detail: when unzipping the scripts in te_base, they end up in
a folder that's out of convention compared to the others, e.g.

> scripts $ tree -L 2
.
├── csw
│   └── 2.0.2
├── wcs
│   └── 1.0.0
├── wfs
│   ├── 1.0.0
│   └── 1.1.0
├── wfs20
│   └── 2.0.0
├── wms
│   ├── 1.1.1
│   └── 1.3.0
└── wps
    └── 1.0.0

As you can see, wfs 2.0 ends up in a subtree of its own, instead of being placed
in wfs/2.0.0, where I would have expected to find it

Maybe there is a good reason for that placement, but wanted to check.

Cheers
Andrea


On Sun, Jul 19, 2015 at 6:01 PM, Andrea Aime <andrea.aime at geo-solutions.it<mailto:andrea.aime at geo-solutions.it>> wrote:
Hi,
following up on this one, I've also tried running the tests form
the command line, and this is what I get in return:

> sh te_console/bin/unix/test.sh -mode=test -session=wfs-2.0.0 -form=forms/wfs-2.0.0.xml -source=wfs20/2.0.0/ctl/wfs-suite.ctl
Testing suite tns:ets-wfs20-1.19 in Test Mode with defaultResult of Pass ...
******************************************************************************************************************************
   Testing tns:Main type Mandatory in Test Mode with defaultResult Pass (wfs-2.0.0)...
      Assertion: The test subject satisfies all applicable constraints.
lug 19, 2015 5:56:35 PM com.occamlab.te.TECore setFormResults
INFORMAZIONI: Setting form results:
 <?xml version="1.0" encoding="UTF-8"?>
<values>
  <value key="fid"/>
  <value key="wfs-uri">http://localhost:8080/geoserver/ows?service=wfs&version=2.0.0&request=GetCapabilities
  </value>
</values>
lug 19, 2015 5:56:35 PM org.opengis.cite.iso19142.util.TestSuiteLogger log
INFORMAZIONI: Using outputDirPath: /home/aaime/devel/cite/te_base/users/aaime/wfs-2.0.0
Fatal Error: Error in call to extension function {public javax.xml.transform.Source org.opengis.cite.iso19142.TestNGController.doTestRun(org.w3c.dom.Document) throws java.lang.Exception}: Exception in extension function java.lang.ExceptionInInitializerError; SystemID: file:/home/aaime/devel/cite/te_base/work/te_base_scripts_wfs20_2.0.0_ctl_wfs-suite.ctl/tns$run-ets-wfs20.fn; Line#: 50; Column#: -1
Fatal Error: Error in call to extension function {public java.lang.Object com.occamlab.te.TECore.callFunction(net.sf.saxon.expr.XPathContext,java.lang.String,java.lang.String,net.sf.saxon.om.NodeInfo) throws java.lang.Exception}: Exception in extension function net.sf.saxon.s9api.SaxonApiException: Error in call to extension function {public javax.xml.transform.Source org.opengis.cite.iso19142.TestNGController.doTestRun(org.w3c.dom.Document) throws java.lang.Exception}: Exception in extension function java.lang.ExceptionInInitializerError; SystemID: file:/home/aaime/devel/cite/te_base/work/te_base_scripts_wfs20_2.0.0_ctl_wfs-suite.ctl/tns$Main.test; Line#: 140; Column#: -1
lug 19, 2015 5:56:36 PM com.occamlab.te.TECore executeTest
GRAVE: Error in call to extension function {public java.lang.Object com.occamlab.te.TECore.callFunction(net.sf.saxon.expr.XPathContext,java.lang.String,java.lang.String,net.sf.saxon.om.NodeInfo) throws java.lang.Exception}: Exception in extension function net.sf.saxon.s9api.SaxonApiException: Error in call to extension function {public javax.xml.transform.Source org.opengis.cite.iso19142.TestNGController.doTestRun(org.w3c.dom.Document) throws java.lang.Exception}: Exception in extension function java.lang.ExceptionInInitializerError
   Test tns:Main Failed
Suite tns:ets-wfs20-1.19 Failed
Exception in thread "ShutdownHook" java.lang.NoClassDefFoundError: Could not initialize class org.apache.derby.jdbc.EmbeddedDriver
at org.apache.derby.jdbc.AutoloadedDriver.getDriverModule(Unknown Source)
at org.apache.derby.jdbc.AutoloadedDriver.connect(Unknown Source)
at java.sql.DriverManager.getConnection(DriverManager.java:664)
at java.sql.DriverManager.getConnection(DriverManager.java:270)
at org.geotoolkit.internal.sql.Dialect$1.shutdown(Dialect.java:79)
at org.geotoolkit.internal.sql.DefaultDataSource.shutdown(DefaultDataSource.java:183)
at org.geotoolkit.referencing.factory.epsg.ThreadedEpsgFactory.dispose(ThreadedEpsgFactory.java:736)
at org.geotoolkit.factory.ShutdownHook.run(ShutdownHook.java:88)


I have noticed that this script does not seem to be classpath compatible with the other ones, as its
dependencies have a version clash on derby, schema-utils, and possibly ets-gml.
I already have wms 1.1 and 1.3, wfs 1.0 and 1.1, wps 1.0, csw 2.0.2, wcs 1.0 and 1.1 installed in
my te_base directory, and the clashes I see are:

.../te_base/resources/lib/derby-10.10.1.1.jar
.../te_base/resources/lib/derby-10.10.2.0.jar

.../te_base/resources/lib/ets-gml32-1.20.jar
.../te_base/resources/lib/ets-gml32-3.2.1-r18.jar

.../te_base/resources/lib/schema-utils-1.5.jar
.../te_base/resources/lib/schema-utils-1.6.jar

Makes me wonder if this test is meant to actually be installed in a te_base along with other
existing tests?

Cheers
Andrea


On Sun, Jul 19, 2015 at 5:38 PM, Andrea Aime <andrea.aime at geo-solutions.it<mailto:andrea.aime at geo-solutions.it>> wrote:
Hi,
I'm trying to make a first run of the WFS 2.0 cite tests, locally, off a freshly
built teamengine (tip of the current master branch, with the OGC profile that
includes all the deps needed to run cite tests, version 15.06.04)
and WFS 2.0 r 1.19

As far as I can see, all tests are getting skipped, which is making me suspicious...
the first error I see is a failure to initialize the Geotoolkit EPSG database:

[exec] Cannot create JDBC driver of class '' for connect URL 'null'
     [exec] org.opengis.util.FactoryException: Failed to connect to the EPSG database.
     [exec] at org.geotoolkit.referencing.factory.epsg.ThreadedEpsgFactory.createBackingStore(ThreadedEpsgFactory.java:678)
     [exec] at org.geotoolkit.referencing.factory.ThreadedAuthorityFactory.getBackingStore(ThreadedAuthorityFactory.java:372)
     [exec] at org.geotoolkit.referencing.factory.CachingAuthorityFactory.availability(CachingAuthorityFactory.java:296)
     [exec] at org.geotoolkit.factory.FactoryRegistry.isAcceptable(FactoryRegistry.java:579)
     [exec] at org.geotoolkit.factory.FactoryRegistry$1.filter(FactoryRegistry.java:237)
     [exec] at javax.imageio.spi.FilterIterator.advance(ServiceRegistry.java:810)
     [exec] at javax.imageio.spi.FilterIterator.next(ServiceRegistry.java:828)
     [exec] at org.geotoolkit.internal.LazySet.addNext(LazySet.java:77)
     [exec] at org.geotoolkit.internal.LazySet.size(LazySet.java:96)
     [exec] at java.util.AbstractCollection.toArray(AbstractCollection.java:136)
     [exec] at java.util.ArrayList.<init>(ArrayList.java:164)
     [exec] at org.geotoolkit.referencing.DefaultAuthorityFactory.create(DefaultAuthorityFactory.java:111)
     [exec] at org.geotoolkit.referencing.CRS.getAuthorityFactory(CRS.java:227)
     [exec] at org.geotoolkit.referencing.CRS.decode(CRS.java:434)
     [exec] at org.opengis.cite.iso19142.FeatureTypeInfo.setDefaultCRS(FeatureTypeInfo.java:89)
     [exec] at org.opengis.cite.iso19142.util.ServiceMetadataUtils.extractFeatureInfo(ServiceMetadataUtils.java:194)
     [exec] at org.opengis.cite.iso19142.SuiteFixtureListener.processWfsParameter(SuiteFixtureListener.java:92)
     [exec] at org.opengis.cite.iso19142.SuiteFixtureListener.onStart(SuiteFixtureListener.java:40)
     [exec] at org.testng.SuiteRunner.invokeListeners(SuiteRunner.java:199)
     [exec] at org.testng.SuiteRunner.run(SuiteRunner.java:252)
     [exec] at org.testng.SuiteRunnerWorker.runSuite(SuiteRunnerWorker.java:52)
     [exec] at org.testng.SuiteRunnerWorker.run(SuiteRunnerWorker.java:86)
     [exec] at org.testng.TestNG.runSuitesSequentially(TestNG.java:1224)
     [exec] at org.testng.TestNG.runSuitesLocally(TestNG.java:1149)
     [exec] at org.testng.TestNG.run(TestNG.java:1057)
     [exec] at com.occamlab.te.spi.executors.testng.TestNGExecutor.execute(TestNGExecutor.java:115)
     [exec] at org.opengis.cite.iso19142.TestNGController.doTestRun(TestNGController.java:119)
     [exec] at sun.reflect.NativeMethodAccessorImpl.invoke0(Native Method)
     [exec] at sun.reflect.NativeMethodAccessorImpl.invoke(NativeMethodAccessorImpl.java:57)
     [exec] at sun.reflect.DelegatingMethodAccessorImpl.invoke(DelegatingMethodAccessorImpl.java:43)
     [exec] at java.lang.reflect.Method.invoke(Method.java:606)
     [exec] at net.sf.saxon.functions.ExtensionFunctionCall.invokeMethod(ExtensionFunctionCall.java:533)
     [exec] at net.sf.saxon.functions.ExtensionFunctionCall.call(ExtensionFunctionCall.java:256)
     [exec] at net.sf.saxon.functions.ExtensionFunctionCall.iterate(ExtensionFunctionCall.java:147)
     [exec] at net.sf.saxon.instruct.CopyOf.processLeavingTail(CopyOf.java:292)
     [exec] at net.sf.saxon.instruct.Block.processLeavingTail(Block.java:409)
     [exec] at net.sf.saxon.instruct.Instruction.process(Instruction.java:94)
     [exec] at net.sf.saxon.expr.LetExpression.process(LetExpression.java:380)
     [exec] at net.sf.saxon.instruct.ForEach.processLeavingTail(ForEach.java:300)
     [exec] at net.sf.saxon.instruct.Block.processLeavingTail(Block.java:409)
     [exec] at net.sf.saxon.instruct.Template.applyLeavingTail(Template.java:175)
     [exec] at net.sf.saxon.instruct.ApplyTemplates.applyTemplates(ApplyTemplates.java:343)
     [exec] at net.sf.saxon.Controller.transformDocument(Controller.java:1736)
     [exec] at net.sf.saxon.Controller.transform(Controller.java:1560)
     [exec] at net.sf.saxon.s9api.XsltTransformer.transform(XsltTransformer.java:190)
     [exec] at com.occamlab.te.TECore.executeTemplate(TECore.java:571)
     [exec] at com.occamlab.te.TECore.executeXSLFunction(TECore.java:1034)
     [exec] at com.occamlab.te.TECore.callFunction(TECore.java:1066)
     [exec] at sun.reflect.NativeMethodAccessorImpl.invoke0(Native Method)
     [exec] at sun.reflect.NativeMethodAccessorImpl.invoke(NativeMethodAccessorImpl.java:57)
     [exec] at sun.reflect.DelegatingMethodAccessorImpl.invoke(DelegatingMethodAccessorImpl.java:43)
     [exec] at java.lang.reflect.Method.invoke(Method.java:606)
     [exec] at net.sf.saxon.functions.ExtensionFunctionCall.invokeMethod(ExtensionFunctionCall.java:533)
     [exec] at net.sf.saxon.functions.ExtensionFunctionCall.call(ExtensionFunctionCall.java:256)
     [exec] at net.sf.saxon.functions.ExtensionFunctionCall.iterate(ExtensionFunctionCall.java:147)
     [exec] at net.sf.saxon.expr.Expression.evaluateItem(Expression.java:352)
     [exec] at net.sf.saxon.expr.Expression.process(Expression.java:461)
     [exec] at net.sf.saxon.instruct.DocumentInstr.evaluateItem(DocumentInstr.java:282)
     [exec] at net.sf.saxon.expr.ExpressionTool.evaluate(ExpressionTool.java:295)
     [exec] at net.sf.saxon.expr.LetExpression.eval(LetExpression.java:341)
     [exec] at net.sf.saxon.expr.LetExpression.processLeavingTail(LetExpression.java:542)
     [exec] at net.sf.saxon.instruct.Block.processLeavingTail(Block.java:409)
     [exec] at net.sf.saxon.expr.LetExpression.processLeavingTail(LetExpression.java:551)
     [exec] at net.sf.saxon.instruct.Block.processLeavingTail(Block.java:409)
     [exec] at net.sf.saxon.expr.LetExpression.processLeavingTail(LetExpression.java:551)
     [exec] at net.sf.saxon.instruct.Block.processLeavingTail(Block.java:409)
     [exec] at net.sf.saxon.expr.LetExpression.processLeavingTail(LetExpression.java:551)
     [exec] at net.sf.saxon.instruct.Block.processLeavingTail(Block.java:409)
     [exec] at net.sf.saxon.instruct.Instruction.process(Instruction.java:94)
     [exec] at net.sf.saxon.expr.LetExpression.process(LetExpression.java:380)
     [exec] at net.sf.saxon.instruct.ForEach.processLeavingTail(ForEach.java:300)
     [exec] at net.sf.saxon.instruct.Template.applyLeavingTail(Template.java:175)
     [exec] at net.sf.saxon.instruct.ApplyTemplates.applyTemplates(ApplyTemplates.java:343)
     [exec] at net.sf.saxon.Controller.transformDocument(Controller.java:1736)
     [exec] at net.sf.saxon.Controller.transform(Controller.java:1560)
     [exec] at net.sf.saxon.s9api.XsltTransformer.transform(XsltTransformer.java:190)
     [exec] at com.occamlab.te.TECore.executeTemplate(TECore.java:571)
     [exec] at com.occamlab.te.TECore.executeTest(TECore.java:779)
     [exec] at com.occamlab.te.TECore.execute_test(TECore.java:390)
     [exec] at com.occamlab.te.TECore.execute_suite(TECore.java:438)
     [exec] at com.occamlab.te.TECore.execute(TECore.java:295)
     [exec] at com.occamlab.te.TECore.run(TECore.java:2273)
     [exec] at java.lang.Thread.run(Thread.java:745)
     [exec] Caused by: org.apache.tomcat.dbcp.dbcp.SQLNestedException: Cannot create JDBC driver of class '' for connect URL 'null'
     [exec] at org.apache.tomcat.dbcp.dbcp.BasicDataSource.createConnectionFactory(BasicDataSource.java:1452)
     [exec] at org.apache.tomcat.dbcp.dbcp.BasicDataSource.createDataSource(BasicDataSource.java:1371)
     [exec] at org.apache.tomcat.dbcp.dbcp.BasicDataSource.getConnection(BasicDataSource.java:1044)
     [exec] at org.geotoolkit.referencing.factory.epsg.ThreadedEpsgFactory.createBackingStore(ThreadedEpsgFactory.java:565)
     [exec] at org.geotoolkit.referencing.factory.epsg.ThreadedEpsgFactory.createBackingStore(ThreadedEpsgFactory.java:652)
     [exec] ... 82 more
     [exec] Caused by: java.lang.NullPointerException
     [exec] at sun.jdbc.odbc.JdbcOdbcDriver.getProtocol(JdbcOdbcDriver.java:524)
     [exec] at sun.jdbc.odbc.JdbcOdbcDriver.knownURL(JdbcOdbcDriver.java:493)
     [exec] at sun.jdbc.odbc.JdbcOdbcDriver.acceptsURL(JdbcOdbcDriver.java:307)
     [exec] at java.sql.DriverManager.getDriver(DriverManager.java:262)
     [exec] at org.apache.tomcat.dbcp.dbcp.BasicDataSource.createConnectionFactory(BasicDataSource.java:1437)
     [exec] ... 86 more
     [exec]

Now, there are several others copies of it after this one, and then some errors that seem to point
to legit issues in GeoServer WFS 2.0 implementation, such as:

     [exec] lug 19, 2015 5:21:58 PM com.sun.jersey.api.client.filter.LoggingFilter log
     [exec] INFORMAZIONI: 1 * Client out-bound request
     [exec] 1 > GET http://localhost:8080/geoserver/wfs?service=WFS&version=2.0.0&request=GetFeature&count=25&startindex=0&typenames=ns13:PrimitiveGeoFeature&namespaces=xmlns(xml,http://www.w3.org/XML/1998/namespace),xmlns(ns13,http://cite.opengeospatial.org/gmlsf),xmlns(wfs,http://www.opengis.net/wfs/2.0)
     [exec]
     [exec] lug 19, 2015 5:21:58 PM com.sun.jersey.api.client.filter.LoggingFilter log
     [exec] INFORMAZIONI: 1 * Client in-bound response
     [exec] 1 < 200
     [exec] 1 < Transfer-Encoding: chunked
     [exec] 1 < Content-Type: application/xml
     [exec] 1 < Server: Jetty(6.1.8)
     [exec] 1 <
     [exec] <ows:ExceptionReport xmlns:xs="http://www.w3.org/2001/XMLSchema" xmlns:ows="http://www.opengis.net/ows/1.1" xmlns:xsi="http://www.w3.org/2001/XMLSchema-instance" version="2.0.0" xsi:schemaLocation="http://www.opengis.net/ows/1.1 http://localhost:8080/geoserver/schemas/ows/1.1.0/owsAll.xsd">
     [exec] <ows:Exception exceptionCode="InvalidParameterValue" locator="namespace">
     [exec] <ows:ExceptionText>Unknown namespace [ns13]</ows:ExceptionText>
     [exec] </ows:Exception>
     [exec] </ows:ExceptionReport>

That said, the final report just says everything PASSED, but also that all tests were skipped (89 of them).

So, I'm trying to understand what I am looking at... is the EPSG db initialization error "normal"
and I should concentrate on the namespace issues, or is that the one causing all tests
to be skipped?

Cheers
Andrea

--
==
GeoServer Professional Services from the experts! Visit
http://goo.gl/it488V for more information.
==

Ing. Andrea Aime
@geowolf
Technical Lead

GeoSolutions S.A.S.
Via Poggio alle Viti 1187
55054  Massarosa (LU)
Italy
phone: +39 0584 962313<tel:%2B39%200584%20962313>
fax: +39 0584 1660272<tel:%2B39%200584%201660272>
mob: +39  339 8844549<tel:%2B39%20%C2%A0339%208844549>

http://www.geo-solutions.it
http://twitter.com/geosolutions_it


AVVERTENZE AI SENSI DEL D.Lgs. 196/2003

Le informazioni contenute in questo messaggio di posta elettronica e/o nel/i file/s allegato/i sono da considerarsi strettamente riservate. Il loro utilizzo è consentito esclusivamente al destinatario del messaggio, per le finalità indicate nel messaggio stesso. Qualora riceviate questo messaggio senza esserne il destinatario, Vi preghiamo cortesemente di darcene notizia via e-mail e di procedere alla distruzione del messaggio stesso, cancellandolo dal Vostro sistema. Conservare il messaggio stesso, divulgarlo anche in parte, distribuirlo ad altri soggetti, copiarlo, od utilizzarlo per finalità diverse, costituisce comportamento contrario ai principi dettati dal D.Lgs. 196/2003.



The information in this message and/or attachments, is intended solely for the attention and use of the named addressee(s) and may be confidential or proprietary in nature or covered by the provisions of privacy act (Legislative Decree June, 30 2003, no.196 - Italy's New Data Protection Code).Any use not in accord with its purpose, any disclosure, reproduction, copying, distribution, or either dissemination, either whole or partial, is strictly forbidden except previous formal approval of the named addressee(s). If you are not the intended recipient, please contact immediately the sender by telephone, fax or e-mail and delete the information in this message that has been received in error. The sender does not give any warranty or accept liability as the content, accuracy or completeness of sent messages and accepts no responsibility  for changes made after they were sent or for other risks which arise as a result of e-mail transmission, viruses, etc.

-------------------------------------------------------



--
==
GeoServer Professional Services from the experts! Visit
http://goo.gl/it488V for more information.
==

Ing. Andrea Aime
@geowolf
Technical Lead

GeoSolutions S.A.S.
Via Poggio alle Viti 1187
55054  Massarosa (LU)
Italy
phone: +39 0584 962313<tel:%2B39%200584%20962313>
fax: +39 0584 1660272<tel:%2B39%200584%201660272>
mob: +39  339 8844549<tel:%2B39%20%C2%A0339%208844549>

http://www.geo-solutions.it
http://twitter.com/geosolutions_it


AVVERTENZE AI SENSI DEL D.Lgs. 196/2003

Le informazioni contenute in questo messaggio di posta elettronica e/o nel/i file/s allegato/i sono da considerarsi strettamente riservate. Il loro utilizzo è consentito esclusivamente al destinatario del messaggio, per le finalità indicate nel messaggio stesso. Qualora riceviate questo messaggio senza esserne il destinatario, Vi preghiamo cortesemente di darcene notizia via e-mail e di procedere alla distruzione del messaggio stesso, cancellandolo dal Vostro sistema. Conservare il messaggio stesso, divulgarlo anche in parte, distribuirlo ad altri soggetti, copiarlo, od utilizzarlo per finalità diverse, costituisce comportamento contrario ai principi dettati dal D.Lgs. 196/2003.



The information in this message and/or attachments, is intended solely for the attention and use of the named addressee(s) and may be confidential or proprietary in nature or covered by the provisions of privacy act (Legislative Decree June, 30 2003, no.196 - Italy's New Data Protection Code).Any use not in accord with its purpose, any disclosure, reproduction, copying, distribution, or either dissemination, either whole or partial, is strictly forbidden except previous formal approval of the named addressee(s). If you are not the intended recipient, please contact immediately the sender by telephone, fax or e-mail and delete the information in this message that has been received in error. The sender does not give any warranty or accept liability as the content, accuracy or completeness of sent messages and accepts no responsibility  for changes made after they were sent or for other risks which arise as a result of e-mail transmission, viruses, etc.

-------------------------------------------------------



--
==
GeoServer Professional Services from the experts! Visit
http://goo.gl/it488V for more information.
==

Ing. Andrea Aime
@geowolf
Technical Lead

GeoSolutions S.A.S.
Via Poggio alle Viti 1187
55054  Massarosa (LU)
Italy
phone: +39 0584 962313
fax: +39 0584 1660272
mob: +39  339 8844549

http://www.geo-solutions.it
http://twitter.com/geosolutions_it


AVVERTENZE AI SENSI DEL D.Lgs. 196/2003

Le informazioni contenute in questo messaggio di posta elettronica e/o nel/i file/s allegato/i sono da considerarsi strettamente riservate. Il loro utilizzo è consentito esclusivamente al destinatario del messaggio, per le finalità indicate nel messaggio stesso. Qualora riceviate questo messaggio senza esserne il destinatario, Vi preghiamo cortesemente di darcene notizia via e-mail e di procedere alla distruzione del messaggio stesso, cancellandolo dal Vostro sistema. Conservare il messaggio stesso, divulgarlo anche in parte, distribuirlo ad altri soggetti, copiarlo, od utilizzarlo per finalità diverse, costituisce comportamento contrario ai principi dettati dal D.Lgs. 196/2003.



The information in this message and/or attachments, is intended solely for the attention and use of the named addressee(s) and may be confidential or proprietary in nature or covered by the provisions of privacy act (Legislative Decree June, 30 2003, no.196 - Italy's New Data Protection Code).Any use not in accord with its purpose, any disclosure, reproduction, copying, distribution, or either dissemination, either whole or partial, is strictly forbidden except previous formal approval of the named addressee(s). If you are not the intended recipient, please contact immediately the sender by telephone, fax or e-mail and delete the information in this message that has been received in error. The sender does not give any warranty or accept liability as the content, accuracy or completeness of sent messages and accepts no responsibility  for changes made after they were sent or for other risks which arise as a result of e-mail transmission, viruses, etc.

-------------------------------------------------------
-------------- next part --------------
An HTML attachment was scrubbed...
URL: <http://lists.opengeospatial.org/pipermail/cite-forum/attachments/20150720/d14725a9/attachment-0001.html>


More information about the CITE-Forum mailing list