[CITE-Forum] SOS 1.0.0 r2 Test Suite with TEAM Engine Beta release

Carsten Hollmann c.hollmann at 52north.org
Thu Mar 22 05:10:15 EDT 2012


Hi,

I have tested the 52°North SOS with the TEAM Engine Beta release. The 
test suite revision for the SOS 1.0.0 was r2.

First, I want to mention some general issues and questions of the SOS 
1.0.0 r2 test I have found:

- Which specifications are used? The information page for the SOS 1.0.0 
r2 test defines that the OGC specifications OWS 1.0 is used but in the 
namespace section 'http://www.opengis.net/ows/1.1' is mentioned. And 
which SOS specification document is used? The OGC 06-009r5 document or 
the OGC 06-009r6 document?

- Why contains the KVP GetCapabilities request in some cases a 'version' 
parameter which is not defined in the specification for this operation?

- If you push the button 'Execute this session again' in the test 
session results the website to define the tests opens. I think, it would 
be nice if the SOS location is set to the URL which was tested before 
and not to the default URL.


The test with the 52°North SOS fails overall and not all tests are 
executed but some executed sub test passed. Here are the descriptions of 
the failed tests:

- owsTests:ows-OWS.GetCapabilities.1
Fails but all sub tests passed. The response is schema valid (tested 
with XMLSpy) and the root element is correct. So I do not have any idea 
why it fails because there are no details in the result.

- sos:general-SOS.General-InvalidRequest.1
Here is the Error message from the result:
Error in call to extension function {public org.w3c.dom.NodeList 
com.occamlab.te.TECore.request(org.w3c.dom.Document,java.lang.String) 
throws java.lang.Throwable}: Exception in extension function 
java.lang.Exception: Error invoking parser 
{http://www.occamlab.com/te/parsers}XMLValidatingParser
org.xml.sax.SAXParseException: schema_reference.4: Failed to read schema 
document 'file:/xsd/ogc/ows/1.1.0/owsExceptionReport.xsd', because 1) 
could not find the document; 2) the document could not be read; 3) the 
root element of the document is not <xsd:schema>.

- sos:core-main
Here is the Error message from the result:
Error in call to extension function {public org.w3c.dom.NodeList 
com.occamlab.te.TECore.request(org.w3c.dom.Document,java.lang.String) 
throws java.lang.Throwable}: Exception in extension function 
java.lang.Exception: Error invoking parser 
{http://www.occamlab.com/te/parsers}XMLValidatingParser
org.xml.sax.SAXParseException: schema_reference.4: Failed to read schema 
document 'file:/xsd/ogc/sos/1.0.0/sosGetCapabilities.xsd', because 1) 
could not find the document; 2) the document could not be read; 3) the 
root element of the document is not <xsd:schema>.

Regards,
Carsten







More information about the CITE-Forum mailing list