[CITE-Forum] New Team Engine 3.1 and WFS 1.1.0 r9

Sebastian Goerke goerke at lat-lon.de
Mon Apr 16 02:59:29 EDT 2012


-----BEGIN PGP SIGNED MESSAGE-----
Hash: SHA1

Hi,

I will look after this problem and try to reproduce it here to find
out, what the problem is.

Regards

Sebastian
- -- 
l a t / l o n  GmbH
Aennchenstrasse 19               53177 Bonn, Germany
phone ++49 +228 18496-0          fax ++49 +228 18496-29
http://www.lat-lon.de            http://www.deegree.org


Am 13.04.2012 16:56, schrieb Jean Luc Daems:
> Hi, Sometimes, I receive errors like this :
> 
> test.bat -mode=retest -logdir=..\log -session=elyx-demo 
> elyx-demo/d1e34704_1/d1e740_1/d1e24749_1/d1e5121_1 .... 
> 13-avr.-2012 16:42:37 com.occamlab.te.TECore parse GRAVE: Error
> invoking parser 
> {http://teamengine.sourceforge.net/parsers}XMLValidatingParser.XMLSchema
>
> 
org.xml.sax.SAXParseException: src-resolve: Cannot resolve the name
'xml:lang'
> to a(n) 'attribute declaration' component. 
> java.lang.reflect.InvocationTargetException at
> sun.reflect.NativeMethodAccessorImpl.invoke0(Native Method) ... 
> Error in call to extension function {public org.w3c.dom.NodeList 
> com.occamlab.te.TECore.request(org.w3c.dom.Document,java.lang.S 
> tring) throws java.lang.Throwable}: Exception in extension function
>  java.lang.Exception: Error invoking parser {http://teamengin 
> e.sourceforge.net/parsers}XMLValidatingParser.XMLSchema 
> org.xml.sax.SAXParseException: src-resolve: Cannot resolve the name
> 'xml:lang' to a(n) 'attribute declaration' component. Test
> wfs:wfs-1.1.0-Basic-DescribeFeatureType-tc3.4 Failed
> 
> Then immediately after, I relaunch the same command and :
> 
> Testing wfs:wfs-1.1.0-Basic-DescribeFeatureType-tc3.4 
> (elyx-demo/d1e34704_1/d1e740_1/d1e24749_1/d1e5121_1)... Assertion:
> The following attributes are required for all XML request entities:
>  @version (default '1.1.0'); @service (default 'WFS'). Testing
> ctl:assert-xpath 
> (elyx-demo/d1e34704_1/d1e740_1/d1e24749_1/d1e5121_1/d1e5511_1)... 
> Assertion: Evaluates the given XPath expression against the input
> document and returns a boolean result according to the XPath
> specification (see 
> http://www.w3.org/TR/xpath#section-Boolean-Functions).
> 
> Test ctl:assert-xpath Passed Test
> wfs:wfs-1.1.0-Basic-DescribeFeatureType-tc3.4 Passed
> 
> I think it's related to 
> http://lists.opengeospatial.org/pipermail/cite-forum/2011-August/000603.html
> but I expected as read that "The bug has been fixed in the beta
> version of the scripts" ?
> 
> Best Regards Jean-Luc
> 
> 
> 
> 
> _______________________________________________ CITE-Forum mailing
> list CITE-Forum at lists.opengeospatial.org 
> https://lists.opengeospatial.org/mailman/listinfo/cite-forum

-----BEGIN PGP SIGNATURE-----
Version: GnuPG v1.4.11 (GNU/Linux)
Comment: Using GnuPG with Mozilla - http://enigmail.mozdev.org/

iEYEARECAAYFAk+Lw0MACgkQq1hDh4aJykI+9ACcD1mWpde4r24siWPMzdjBIB1q
mBMAoKer0HClI8Hrakc/iiVKFn4YpRIC
=EK5p
-----END PGP SIGNATURE-----


More information about the CITE-Forum mailing list